Target
Sphingosine 1-phosphate receptor 3
Ligand
BDBM37343
Substrate
Meas. Tech.
S1P3 Agonist Dose-Response Potency Assay
EC50
47400±n/a nM
Citation
 PubChem, PC S1P3 Agonist Dose-Response Potency Assay PubChem Bioassay (2007)[AID] 
Target
Name:
Sphingosine 1-phosphate receptor 3
Synonyms:
C9orf108 EDG3 S1P receptor 3 S1P3 S1PR3_HUMAN Sphingosine 1-phosphate receptor 3 (S1P3) | Sphingosine 1-phosphate receptor Edg-3
Type:
G Protein-Coupled Receptor (GPCR)
Mol. Mass.:
42278.13
Organism:
Homo sapiens (Human)
Description:
Q99500
Residue:
378
  
Inhibitor
Name:
BDBM37343
Synonyms:
2-[(5,6-diphenyl-1,2,4-triazin-3-yl)sulfanyl]acetonitrile 2-[(5,6-diphenyl-1,2,4-triazin-3-yl)thio]acetonitrile SMR000104998 | cid_2870544
Type:
Small organic molecule
Emp. Form.:
C17H12N4S
Mol. Mass.:
304.369
SMILES:
N#CCSc1nnc(-c2ccccc2)c(n1)-c1ccccc1
: