Target
Sphingosine 1-phosphate receptor 1
Ligand
BDBM36818
Substrate
Meas. Tech.
Dose Response Assays for S1P1 Agonists and Agonism Potentiators - Parental Cell Line Counter Screen 60K MLSMR
EC50
>95100±n/a nM
Citation
 PubChem, PC Dose Response Assays for S1P1 Agonists and Agonism Potentiators - Parental Cell Line Counter Screen 60K MLSMR PubChem Bioassay (2007)[AID] 
Target
Name:
Sphingosine 1-phosphate receptor 1
Synonyms:
CHEDG1 Endothelial differentiation G-protein coupled receptor 1 S1P1 S1PR1_HUMAN Sphingosine 1-phosphate receptor Edg-1
Type:
Enzyme
Mol. Mass.:
42836.02
Organism:
Homo sapiens (Human)
Description:
P21453
Residue:
382
  
Inhibitor
Name:
BDBM36818
Synonyms:
MLS000068975 N-[4-(5-methyl-1,3-benzoxazol-2-yl)phenyl]-3-pyridinecarboxamide N-[4-(5-methyl-1,3-benzoxazol-2-yl)phenyl]pyridine-3-carboxamide cid_645017
Type:
Small organic molecule
Emp. Form.:
C20H15N3O2
Mol. Mass.:
329.352
SMILES:
Cc1ccc2oc(nc2c1)-c1ccc(NC(=O)c2cccnc2)cc1
: