Target
Sphingosine 1-phosphate receptor 1
Ligand
BDBM36878
Substrate
Meas. Tech.
Dose Response Assays for S1P1 Agonists and Agonism Potentiators - Parental Cell Line Counter Screen 60K MLSMR
EC50
>95100±n/a nM
Citation
 PubChem, PC Dose Response Assays for S1P1 Agonists and Agonism Potentiators - Parental Cell Line Counter Screen 60K MLSMR PubChem Bioassay (2007)[AID] 
Target
Name:
Sphingosine 1-phosphate receptor 1
Synonyms:
CHEDG1 Endothelial differentiation G-protein coupled receptor 1 S1P1 S1PR1_HUMAN Sphingosine 1-phosphate receptor Edg-1
Type:
Enzyme
Mol. Mass.:
42836.02
Organism:
Homo sapiens (Human)
Description:
P21453
Residue:
382
  
Inhibitor
Name:
BDBM36878
Synonyms:
2-[4-(5-methyl-[1,2,4]triazolo[1,5-a]pyrimidin-7-yl)-1-piperazinyl]-1,3-benzothiazole 2-[4-(5-methyl-[1,2,4]triazolo[1,5-a]pyrimidin-7-yl)piperazino]-1,3-benzothiazole MLS000029982 cid_655948
Type:
Small organic molecule
Emp. Form.:
C17H17N7S
Mol. Mass.:
351.429
SMILES:
Cc1cc(N2CCN(CC2)c2nc3ccccc3s2)n2ncnc2n1
: