Target
Sphingosine 1-phosphate receptor 3
Ligand
BDBM37368
Substrate
Meas. Tech.
Dose Response Assay for S1P3 Antagonists
IC50
>49800±n/a nM
Citation
 PubChem, PC Dose Response Assay for S1P3 Antagonists PubChem Bioassay (2007)[AID] 
Target
Name:
Sphingosine 1-phosphate receptor 3
Synonyms:
C9orf108 EDG3 S1P receptor 3 S1P3 S1PR3_HUMAN Sphingosine 1-phosphate receptor 3 (S1P3) | Sphingosine 1-phosphate receptor Edg-3
Type:
G Protein-Coupled Receptor (GPCR)
Mol. Mass.:
42278.13
Organism:
Homo sapiens (Human)
Description:
Q99500
Residue:
378
  
Inhibitor
Name:
BDBM37368
Synonyms:
1-N-benzyl-4-N-[(2-fluorophenyl)methyl]piperidine-1,4-dicarboxamide N-benzyl-N'-(2-fluorobenzyl)piperidine-1,4-dicarboxamide Piperidine-1,4-dicarboxylic acid 1-benzylamide 4-(2-fluoro-benzylamide) cid_653714
Type:
Small organic molecule
Emp. Form.:
C21H24FN3O2
Mol. Mass.:
369.4326
SMILES:
Fc1ccccc1CNC(=O)C1CCN(CC1)C(=O)NCc1ccccc1
: