Target
Sphingosine 1-phosphate receptor 3
Ligand
BDBM34278
Substrate
Meas. Tech.
Dose Response Assay for S1P3 Antagonists
IC50
>49800±n/a nM
Citation
 PubChem, PC Dose Response Assay for S1P3 Antagonists PubChem Bioassay (2007)[AID] 
Target
Name:
Sphingosine 1-phosphate receptor 3
Synonyms:
C9orf108 EDG3 S1P receptor 3 S1P3 S1PR3_HUMAN Sphingosine 1-phosphate receptor 3 (S1P3) | Sphingosine 1-phosphate receptor Edg-3
Type:
G Protein-Coupled Receptor (GPCR)
Mol. Mass.:
42278.13
Organism:
Homo sapiens (Human)
Description:
Q99500
Residue:
378
  
Inhibitor
Name:
BDBM34278
Synonyms:
1-(3,4-dihydroxyphenyl)-2-[[4-ethyl-5-(2-methoxyphenyl)-1,2,4-triazol-3-yl]sulfanyl]ethanone 1-[3,4-bis(oxidanyl)phenyl]-2-[[4-ethyl-5-(2-methoxyphenyl)-1,2,4-triazol-3-yl]sulfanyl]ethanone SMR000038049 | cid_665183
Type:
Small organic molecule
Emp. Form.:
C19H19N3O4S
Mol. Mass.:
385.437
SMILES:
CCn1c(SCC(=O)c2ccc(O)c(O)c2)nnc1-c1ccccc1OC
: