Target
Sphingosine 1-phosphate receptor 3
Ligand
BDBM37387
Substrate
Meas. Tech.
Dose Response Assay for S1P3 Antagonists
IC50
>49800±n/a nM
Citation
 PubChem, PC Dose Response Assay for S1P3 Antagonists PubChem Bioassay (2007)[AID] 
Target
Name:
Sphingosine 1-phosphate receptor 3
Synonyms:
C9orf108 EDG3 S1P receptor 3 S1P3 S1PR3_HUMAN Sphingosine 1-phosphate receptor 3 (S1P3) | Sphingosine 1-phosphate receptor Edg-3
Type:
G Protein-Coupled Receptor (GPCR)
Mol. Mass.:
42278.13
Organism:
Homo sapiens (Human)
Description:
Q99500
Residue:
378
  
Inhibitor
Name:
BDBM37387
Synonyms:
MLS000058437 N-[(4-fluorophenyl)methyl]-3-methyl-4-oxidanylidene-phthalazine-1-carboxamide N-[(4-fluorophenyl)methyl]-3-methyl-4-oxophthalazine-1-carboxamide cid_2085605
Type:
Small organic molecule
Emp. Form.:
C17H14FN3O2
Mol. Mass.:
311.3104
SMILES:
Cn1nc(C(=O)NCc2ccc(F)cc2)c2ccccc2c1=O
: