Target
Sphingosine 1-phosphate receptor 3
Ligand
BDBM37420
Substrate
Meas. Tech.
Dose Response Assay for S1P3 Antagonists
IC50
>49800±n/a nM
Citation
 PubChem, PC Dose Response Assay for S1P3 Antagonists PubChem Bioassay (2007)[AID] 
Target
Name:
Sphingosine 1-phosphate receptor 3
Synonyms:
C9orf108 EDG3 S1P receptor 3 S1P3 S1PR3_HUMAN Sphingosine 1-phosphate receptor 3 (S1P3) | Sphingosine 1-phosphate receptor Edg-3
Type:
G Protein-Coupled Receptor (GPCR)
Mol. Mass.:
42278.13
Organism:
Homo sapiens (Human)
Description:
Q99500
Residue:
378
  
Inhibitor
Name:
BDBM37420
Synonyms:
1-[7-(4-chlorophenyl)-5-methyl-1,7-dihydro-[1,2,4]triazolo[1,5-a]pyrimidin-6-yl]ethanone MLS000099573 cid_5733916
Type:
Small organic molecule
Emp. Form.:
C14H13ClN4O
Mol. Mass.:
288.732
SMILES:
CC(=O)C1C(c2ccc(Cl)cc2)n2ncnc2N=C1C
: