Target
Sphingosine 1-phosphate receptor 3
Ligand
BDBM37431
Substrate
Meas. Tech.
Dose Response Assay for S1P3 Antagonists
IC50
>49800±n/a nM
Citation
 PubChem, PC Dose Response Assay for S1P3 Antagonists PubChem Bioassay (2007)[AID] 
Target
Name:
Sphingosine 1-phosphate receptor 3
Synonyms:
C9orf108 EDG3 S1P receptor 3 S1P3 S1PR3_HUMAN Sphingosine 1-phosphate receptor 3 (S1P3) | Sphingosine 1-phosphate receptor Edg-3
Type:
G Protein-Coupled Receptor (GPCR)
Mol. Mass.:
42278.13
Organism:
Homo sapiens (Human)
Description:
Q99500
Residue:
378
  
Inhibitor
Name:
BDBM37431
Synonyms:
3,4-dimethoxy-N-(3-methoxyphenyl)benzenesulfonamide SMR000069923 | cid_778398
Type:
Small organic molecule
Emp. Form.:
C15H17NO5S
Mol. Mass.:
323.364
SMILES:
COc1cccc(NS(=O)(=O)c2ccc(OC)c(OC)c2)c1
: