Target
Sphingosine 1-phosphate receptor 3
Ligand
BDBM37473
Substrate
Meas. Tech.
Dose Response Assay for S1P3 Antagonists
IC50
>49800±n/a nM
Citation
 PubChem, PC Dose Response Assay for S1P3 Antagonists PubChem Bioassay (2007)[AID] 
Target
Name:
Sphingosine 1-phosphate receptor 3
Synonyms:
C9orf108 EDG3 S1P receptor 3 S1P3 S1PR3_HUMAN Sphingosine 1-phosphate receptor 3 (S1P3) | Sphingosine 1-phosphate receptor Edg-3
Type:
G Protein-Coupled Receptor (GPCR)
Mol. Mass.:
42278.13
Organism:
Homo sapiens (Human)
Description:
Q99500
Residue:
378
  
Inhibitor
Name:
BDBM37473
Synonyms:
MLS000118559 N-(2-fluorophenyl)-2-[[4-methyl-5-[(2-oxo-1,3-benzothiazol-3-yl)methyl]-1,2,4-triazol-3-yl]sulfanyl]acetamide N-(2-fluorophenyl)-2-[[5-[(2-keto-1,3-benzothiazol-3-yl)methyl]-4-methyl-1,2,4-triazol-3-yl]thio]acetamide cid_5308647
Type:
Small organic molecule
Emp. Form.:
C19H16FN5O2S2
Mol. Mass.:
429.491
SMILES:
Cn1c(Cn2c3ccccc3sc2=O)nnc1SCC(=O)Nc1ccccc1F
: