Target
Huntingtin
Ligand
BDBM37518
Substrate
Meas. Tech.
Clearance of Mutant Huntingtin Protein - Confirmatory screen
IC50
>8000±n/a nM
Citation
 PubChem, PC Clearance of Mutant Huntingtin Protein - Confirmatory screen PubChem Bioassay (2007)[AID] 
Target
Name:
Huntingtin
Synonyms:
HD HD_HUMAN Homo sapiens huntingtin (HTT), mRNA Huntington disease protein | IT15
Type:
PROTEIN
Mol. Mass.:
347579.69
Organism:
Homo sapiens (Human)
Description:
EBI_101216
Residue:
3142
  
Inhibitor
Name:
BDBM37518
Synonyms:
MLS000074703 N-[2-(tert-butylamino)-2-oxidanylidene-ethyl]-N-(thiophen-2-ylmethyl)-1,2,3-thiadiazole-4-carboxamide N-[2-(tert-butylamino)-2-oxoethyl]-N-(thiophen-2-ylmethyl)thiadiazole-4-carboxamide [1,2,3]Thiadiazole-4-carboxylic acid (tert-butylcarbamoyl-methyl)-thiophen-2-ylmethyl-amide | cid_644558
Type:
Small organic molecule
Emp. Form.:
C14H18N4O2S2
Mol. Mass.:
338.448
SMILES:
CC(C)(C)NC(=O)CN(Cc1cccs1)C(=O)c1csnn1
: