Target
Huntingtin
Ligand
BDBM37546
Substrate
Meas. Tech.
Clearance of Mutant Huntingtin Protein - Confirmatory screen
IC50
>8000±n/a nM
Citation
 PubChem, PC Clearance of Mutant Huntingtin Protein - Confirmatory screen PubChem Bioassay (2007)[AID] 
Target
Name:
Huntingtin
Synonyms:
HD HD_HUMAN Homo sapiens huntingtin (HTT), mRNA Huntington disease protein | IT15
Type:
PROTEIN
Mol. Mass.:
347579.69
Organism:
Homo sapiens (Human)
Description:
EBI_101216
Residue:
3142
  
Inhibitor
Name:
BDBM37546
Synonyms:
2-(3,4-dimethoxyphenyl)-5-(4-morpholinyl)-4-oxazolecarbonitrile 2-(3,4-dimethoxyphenyl)-5-morpholino-oxazole-4-carbonitrile SMR000045250 | cid_664308
Type:
Small organic molecule
Emp. Form.:
C16H17N3O4
Mol. Mass.:
315.3239
SMILES:
COc1ccc(cc1OC)-c1nc(C#N)c(o1)N1CCOCC1
: