Target
Huntingtin
Ligand
BDBM37548
Substrate
Meas. Tech.
Clearance of Mutant Huntingtin Protein - Confirmatory screen
IC50
>8000±n/a nM
Citation
 PubChem, PC Clearance of Mutant Huntingtin Protein - Confirmatory screen PubChem Bioassay (2007)[AID] 
Target
Name:
Huntingtin
Synonyms:
HD HD_HUMAN Homo sapiens huntingtin (HTT), mRNA Huntington disease protein | IT15
Type:
PROTEIN
Mol. Mass.:
347579.69
Organism:
Homo sapiens (Human)
Description:
EBI_101216
Residue:
3142
  
Inhibitor
Name:
BDBM37548
Synonyms:
(5,7-dimethyl-[1,2,4]triazolo[1,5-a]pyrimidin-2-yl)-veratryl-amine N-[(3,4-dimethoxyphenyl)methyl]-5,7-dimethyl-[1,2,4]triazolo[1,5-a]pyrimidin-2-amine cid_667174
Type:
Small organic molecule
Emp. Form.:
C16H19N5O2
Mol. Mass.:
313.3544
SMILES:
COc1ccc(CNc2nc3nc(C)cc(C)n3n2)cc1OC
: