Target
Huntingtin
Ligand
BDBM37554
Substrate
Meas. Tech.
Clearance of Mutant Huntingtin Protein - Confirmatory screen
IC50
>8000±n/a nM
Citation
 PubChem, PC Clearance of Mutant Huntingtin Protein - Confirmatory screen PubChem Bioassay (2007)[AID] 
Target
Name:
Huntingtin
Synonyms:
HD HD_HUMAN Homo sapiens huntingtin (HTT), mRNA Huntington disease protein | IT15
Type:
PROTEIN
Mol. Mass.:
347579.69
Organism:
Homo sapiens (Human)
Description:
EBI_101216
Residue:
3142
  
Inhibitor
Name:
BDBM37554
Synonyms:
2-(4-fluoroanilino)-N-(2-furanylmethyl)benzamide 2-(4-fluoroanilino)-N-(furan-2-ylmethyl)benzamide MLS000055854 cid_2525456
Type:
Small organic molecule
Emp. Form.:
C18H15FN2O2
Mol. Mass.:
310.3223
SMILES:
Fc1ccc(Nc2ccccc2C(=O)NCc2ccco2)cc1
: