Target
Huntingtin
Ligand
BDBM37562
Substrate
Meas. Tech.
Clearance of Mutant Huntingtin Protein - Confirmatory screen
IC50
>8000±n/a nM
Citation
 PubChem, PC Clearance of Mutant Huntingtin Protein - Confirmatory screen PubChem Bioassay (2007)[AID] 
Target
Name:
Huntingtin
Synonyms:
HD HD_HUMAN Homo sapiens huntingtin (HTT), mRNA Huntington disease protein | IT15
Type:
PROTEIN
Mol. Mass.:
347579.69
Organism:
Homo sapiens (Human)
Description:
EBI_101216
Residue:
3142
  
Inhibitor
Name:
BDBM37562
Synonyms:
MLS000085785 N-(4-amino-1,2,5-oxadiazol-3-yl)-2-(1,3-benzothiazol-2-ylthio)acetamide N-(4-azanyl-1,2,5-oxadiazol-3-yl)-2-(1,3-benzothiazol-2-ylsulfanyl)ethanamide cid_627918
Type:
Small organic molecule
Emp. Form.:
C11H9N5O2S2
Mol. Mass.:
307.351
SMILES:
Nc1nonc1NC(=O)CSc1nc2ccccc2s1
: