Target
Huntingtin
Ligand
BDBM37594
Substrate
Meas. Tech.
Clearance of Mutant Huntingtin Protein - Confirmatory screen
IC50
>8000±n/a nM
Citation
 PubChem, PC Clearance of Mutant Huntingtin Protein - Confirmatory screen PubChem Bioassay (2007)[AID] 
Target
Name:
Huntingtin
Synonyms:
HD HD_HUMAN Homo sapiens huntingtin (HTT), mRNA Huntington disease protein | IT15
Type:
PROTEIN
Mol. Mass.:
347579.69
Organism:
Homo sapiens (Human)
Description:
EBI_101216
Residue:
3142
  
Inhibitor
Name:
BDBM37594
Synonyms:
3-(dimethylaminomethyleneamino)-4-keto-5-methyl-thieno[2,3-d]pyrimidine-6-carboxylic acid ethyl ester MLS000107507 cid_2856627 ethyl 3-(dimethylaminomethylideneamino)-5-methyl-4-oxothieno[2,3-d]pyrimidine-6-carboxylate
Type:
Small organic molecule
Emp. Form.:
C13H16N4O3S
Mol. Mass.:
308.356
SMILES:
CCOC(=O)c1sc2ncn(N=CN(C)C)c(=O)c2c1C
: