Target
fMet-Leu-Phe receptor
Ligand
BDBM37638
Substrate
Meas. Tech.
Dose Response Assay for Formylpeptide Receptor (FPR) Ligands and Dose Response Counter-Screen Assay for Formylpeptide-Like-1 (FPRL1) Ligands
Ki
7900±n/a nM
Citation
 PubChem, PC Dose Response Assay for Formylpeptide Receptor (FPR) Ligands and Dose Response Counter-Screen Assay for Formylpeptide-Like-1 (FPRL1) Ligands PubChem Bioassay (2007)[AID] 
Target
Name:
fMet-Leu-Phe receptor
Synonyms:
FPR FPR1_HUMAN N-formyl peptide receptor 1 fMLP receptor formyl peptide receptor 1
Type:
Enzyme Catalytic Domain
Mol. Mass.:
38456.14
Organism:
Homo sapiens (Human)
Description:
gi_4503779
Residue:
350
  
Inhibitor
Name:
BDBM37638
Synonyms:
MLS000068757 N-[3-cyano-1-(2-methylphenyl)pyrrolo[3,2-b]quinoxalin-2-yl]propanamide SMR000039884 | cid_658811
Type:
Small organic molecule
Emp. Form.:
C21H17N5O
Mol. Mass.:
355.3926
SMILES:
CCC(=O)Nc1c(C#N)c2nc3ccccc3nc2n1-c1ccccc1C
: