Target
fMet-Leu-Phe receptor
Ligand
BDBM34503
Substrate
Meas. Tech.
Dose Response Assay for Formylpeptide Receptor (FPR) Ligands and Dose Response Counter-Screen Assay for Formylpeptide-Like-1 (FPRL1) Ligands
Ki
12900±n/a nM
Citation
 PubChem, PC Dose Response Assay for Formylpeptide Receptor (FPR) Ligands and Dose Response Counter-Screen Assay for Formylpeptide-Like-1 (FPRL1) Ligands PubChem Bioassay (2007)[AID] 
Target
Name:
fMet-Leu-Phe receptor
Synonyms:
FPR FPR1_HUMAN N-formyl peptide receptor 1 fMLP receptor formyl peptide receptor 1
Type:
Enzyme Catalytic Domain
Mol. Mass.:
38456.14
Organism:
Homo sapiens (Human)
Description:
gi_4503779
Residue:
350
  
Inhibitor
Name:
BDBM34503
Synonyms:
3-cyclohexyl-6-keto-8-(2-methoxy-1-naphthyl)-2,4,7,8-tetrahydropyrido[2,1-b][1,3,5]thiadiazine-9-carbonitrile 3-cyclohexyl-8-(2-methoxynaphthalen-1-yl)-6-oxidanylidene-2,4,7,8-tetrahydropyrido[2,1-b][1,3,5]thiadiazine-9-carbonitrile MLS000117271 cid_5307697
Type:
Small organic molecule
Emp. Form.:
C25H27N3O2S
Mol. Mass.:
433.566
SMILES:
COc1ccc2ccccc2c1C1CC(=O)N2CN(CSC2=C1C#N)C1CCCCC1
: