Target
fMet-Leu-Phe receptor
Ligand
BDBM37812
Substrate
Meas. Tech.
Dose Response Assay for Formylpeptide Receptor (FPR) Ligands and Dose Response Counter-Screen Assay for Formylpeptide-Like-1 (FPRL1) Ligands
Ki
17700±n/a nM
Citation
 PubChem, PC Dose Response Assay for Formylpeptide Receptor (FPR) Ligands and Dose Response Counter-Screen Assay for Formylpeptide-Like-1 (FPRL1) Ligands PubChem Bioassay (2007)[AID] 
Target
Name:
fMet-Leu-Phe receptor
Synonyms:
FPR FPR1_HUMAN N-formyl peptide receptor 1 fMLP receptor formyl peptide receptor 1
Type:
Enzyme Catalytic Domain
Mol. Mass.:
38456.14
Organism:
Homo sapiens (Human)
Description:
gi_4503779
Residue:
350
  
Inhibitor
Name:
BDBM37812
Synonyms:
1-(2-furanylmethyl)-4-hydroxy-3-[oxo(thiophen-2-yl)methyl]-2-(3,4,5-trimethoxyphenyl)-2H-pyrrol-5-one 1-(furan-2-ylmethyl)-4-hydroxy-3-(thiophene-2-carbonyl)-2-(3,4,5-trimethoxyphenyl)-2H-pyrrol-5-one MLS000113983 cid_2934026
Type:
Small organic molecule
Emp. Form.:
C23H21NO7S
Mol. Mass.:
455.48
SMILES:
COc1cc(cc(OC)c1OC)C1C(C(=O)c2cccs2)C(=O)C(=O)N1Cc1ccco1
: