Target
N-formyl peptide receptor 2
Ligand
BDBM37639
Substrate
Meas. Tech.
Dose Response Assay for Formylpeptide Receptor-Like-1 (FPRL1) Ligands and Dose Response Counter-Screen Assay for Formylpeptide Receptor (FPR) Ligands
Ki
>40300±n/a nM
Comments
Extracted from aid = 520 and tid = 2
Citation
 PubChem, PC Dose Response Assay for Formylpeptide Receptor-Like-1 (FPRL1) Ligands and Dose Response Counter-Screen Assay for Formylpeptide Receptor (FPR) Ligands PubChem Bioassay (2007)[AID] 
Target
Name:
N-formyl peptide receptor 2
Synonyms:
ALXR, FPRL1, FPR2 FPR2 FPRH1 Formyl Peptide Receptor-Like 1 LXA4 receptor Lipoxin A4 receptor RFP | hFPRL
Type:
G Protein-Coupled Receptor (GPCR)
Mol. Mass.:
38968.35
Organism:
Homo sapiens (Human)
Description:
P25090
Residue:
351
  
Inhibitor
Name:
BDBM37639
Synonyms:
MLS000079918 N-(1-butyl-3-cyano-pyrrolo[3,2-b]quinoxalin-2-yl)propanamide N-(1-butyl-3-cyanopyrrolo[3,2-b]quinoxalin-2-yl)propanamide cid_658816
Type:
Small organic molecule
Emp. Form.:
C18H19N5O
Mol. Mass.:
321.3764
SMILES:
CCCCn1c(NC(=O)CC)c(C#N)c2nc3ccccc3nc12
: