Target
N-formyl peptide receptor 2
Ligand
BDBM37830
Substrate
Meas. Tech.
Dose Response Assay for Formylpeptide Receptor-Like-1 (FPRL1) Ligands and Dose Response Counter-Screen Assay for Formylpeptide Receptor (FPR) Ligands
Ki
>40300±n/a nM
Comments
Extracted from aid = 520 and tid = 2
Citation
 PubChem, PC Dose Response Assay for Formylpeptide Receptor-Like-1 (FPRL1) Ligands and Dose Response Counter-Screen Assay for Formylpeptide Receptor (FPR) Ligands PubChem Bioassay (2007)[AID] 
Target
Name:
N-formyl peptide receptor 2
Synonyms:
ALXR, FPRL1, FPR2 FPR2 FPRH1 Formyl Peptide Receptor-Like 1 LXA4 receptor Lipoxin A4 receptor RFP | hFPRL
Type:
G Protein-Coupled Receptor (GPCR)
Mol. Mass.:
38968.35
Organism:
Homo sapiens (Human)
Description:
P25090
Residue:
351
  
Inhibitor
Name:
BDBM37830
Synonyms:
7-methoxy-2-methyl-3-(1-phenyl-1H-pyrazol-4-yl)-4H-chromen-4-one 7-methoxy-2-methyl-3-(1-phenylpyrazol-4-yl)chromen-4-one MLS000532125 cid_786636
Type:
Small organic molecule
Emp. Form.:
C20H16N2O3
Mol. Mass.:
332.3526
SMILES:
COc1ccc2c(c1)oc(C)c(-c1cnn(c1)-c1ccccc1)c2=O
: