Target
cAMP-dependent protein kinase catalytic subunit alpha
Ligand
BDBM37892
Substrate
Meas. Tech.
Dose-response biochemical assay for inhibitors of protein kinase A (PKA) activity
IC50
70090±n/a nM
Citation
 PubChem, PC Dose-response biochemical assay for inhibitors of protein kinase A (PKA) activity PubChem Bioassay (2007)[AID] 
Target
Name:
cAMP-dependent protein kinase catalytic subunit alpha
Synonyms:
KAPCA_HUMAN PKACA cAMP-dependent protein kinase (PKA) cAMP-dependent protein kinase catalytic subunit alpha cAMP-dependent protein kinase catalytic subunit alpha (PKACA) cAMP-dependent protein kinase catalytic subunit alpha isoform 1 | cAMP-dependent protein kinase, alpha-catalytic subunit
Type:
Enzyme Catalytic Subunit
Mol. Mass.:
40598.73
Organism:
Homo sapiens (Human)
Description:
Residue:
351
  
Inhibitor
Name:
BDBM37892
Synonyms:
MLS000039883 cid_664452
Type:
Small organic molecule
Emp. Form.:
C15H16N4O2
Mol. Mass.:
284.3131
SMILES:
CC1(C)Cc2c(CO1)c(nc1n[nH]c(N)c21)-c1ccco1
: