Target
cAMP-dependent protein kinase catalytic subunit alpha
Ligand
BDBM37914
Substrate
Meas. Tech.
Dose-response biochemical assay for inhibitors of protein kinase A (PKA) activity
IC50
>59640±n/a nM
Citation
 PubChem, PC Dose-response biochemical assay for inhibitors of protein kinase A (PKA) activity PubChem Bioassay (2007)[AID] 
Target
Name:
cAMP-dependent protein kinase catalytic subunit alpha
Synonyms:
KAPCA_HUMAN PKACA cAMP-dependent protein kinase (PKA) cAMP-dependent protein kinase catalytic subunit alpha cAMP-dependent protein kinase catalytic subunit alpha (PKACA) cAMP-dependent protein kinase catalytic subunit alpha isoform 1 | cAMP-dependent protein kinase, alpha-catalytic subunit
Type:
Enzyme Catalytic Subunit
Mol. Mass.:
40598.73
Organism:
Homo sapiens (Human)
Description:
Residue:
351
  
Inhibitor
Name:
BDBM37914
Synonyms:
4-(5-{[(4-methylphenyl)thio]methyl}-1,2,4-oxadiazol-3-yl)pyridine 5-[(p-tolylthio)methyl]-3-(4-pyridyl)-1,2,4-oxadiazole MLS000065343 cid_2219801
Type:
Small organic molecule
Emp. Form.:
C15H13N3OS
Mol. Mass.:
283.348
SMILES:
Cc1ccc(SCc2nc(no2)-c2ccncc2)cc1
: