Target
cAMP-dependent protein kinase catalytic subunit alpha
Ligand
BDBM37924
Substrate
Meas. Tech.
Dose-response biochemical assay for inhibitors of protein kinase A (PKA) activity
IC50
6795±n/a nM
Citation
 PubChem, PC Dose-response biochemical assay for inhibitors of protein kinase A (PKA) activity PubChem Bioassay (2007)[AID] 
Target
Name:
cAMP-dependent protein kinase catalytic subunit alpha
Synonyms:
KAPCA_HUMAN PKACA cAMP-dependent protein kinase (PKA) cAMP-dependent protein kinase catalytic subunit alpha cAMP-dependent protein kinase catalytic subunit alpha (PKACA) cAMP-dependent protein kinase catalytic subunit alpha isoform 1 | cAMP-dependent protein kinase, alpha-catalytic subunit
Type:
Enzyme Catalytic Subunit
Mol. Mass.:
40598.73
Organism:
Homo sapiens (Human)
Description:
Residue:
351
  
Inhibitor
Name:
BDBM37924
Synonyms:
6-(1-piperidinyl)-7H-purine 6-piperidino-7H-purine SMR000015510 | cid_3129049
Type:
Small organic molecule
Emp. Form.:
C10H13N5
Mol. Mass.:
203.2437
SMILES:
C1CCN(CC1)c1ncnc2nc[nH]c12
: