Target
Diphosphomevalonate decarboxylase
Ligand
BDBM38431
Substrate
Meas. Tech.
Screening for Inhibitors of the Mevalonate Pathway in Streptococcus Pneumoniae - DPM-DC Dose Response
IC50
13886.7±n/a nM
Citation
 PubChem, PC Screening for Inhibitors of the Mevalonate Pathway in Streptococcus Pneumoniae - DPM-DC Dose Response PubChem Bioassay (2007)[AID] 
Target
Name:
Diphosphomevalonate decarboxylase
Synonyms:
Type:
Enzyme Catalytic Domain
Mol. Mass.:
35571.44
Organism:
Streptococcus pneumoniae D39
Description:
A0A0H2ZN59
Residue:
317
  
Inhibitor
Name:
BDBM38431
Synonyms:
6-methoxy-N-(2-thenyl)furo[2,3-b]quinoline-2-carboxamide 6-methoxy-N-(thiophen-2-ylmethyl)-2-furo[2,3-b]quinolinecarboxamide MLS000091906 cid_3245490
Type:
Small organic molecule
Emp. Form.:
C18H14N2O3S
Mol. Mass.:
338.38
SMILES:
COc1ccc2nc3oc(cc3cc2c1)C(=O)NCc1cccs1
: