Target
Dual specificity protein phosphatase 6
Ligand
BDBM35378
Substrate
Meas. Tech.
In vitro MKP-3 Phosphatase Dose Response Hit/Probe Assessment Assay
IC50
>50000±n/a nM
Citation
 PubChem, PC In vitro MKP-3 Phosphatase Dose Response Hit/Probe Assessment Assay PubChem Bioassay (2007)[AID] 
Target
Name:
Dual specificity protein phosphatase 6
Synonyms:
DUS6_RAT MAP kinase phosphatase 3 Mitogen-activated protein kinase phosphatase 3 | Mkp3
Type:
Enzyme
Mol. Mass.:
42303.19
Organism:
Rattus norvegicus
Description:
gi_16758752
Residue:
381
  
Inhibitor
Name:
BDBM35378
Synonyms:
4-keto-2,3,3a,5-tetrahydro-1H-pyrrolo[1,2-a]quinoxaline-7-carboxylic acid [2-(3,4-dimethylanilino)-2-keto-ethyl] ester MLS000053833 [2-(3,4-dimethylanilino)-2-oxoethyl] 4-oxo-2,3,3a,5-tetrahydro-1H-pyrrolo[1,2-a]quinoxaline-7-carboxylate cid_2999744
Type:
Small organic molecule
Emp. Form.:
C22H23N3O4
Mol. Mass.:
393.4357
SMILES:
Cc1ccc(NC(=O)COC(=O)c2ccc3N4CCCC4C(=O)Nc3c2)cc1C
: