Target
Dual specificity protein phosphatase 6
Ligand
BDBM35425
Substrate
Meas. Tech.
In vitro MKP-3 Phosphatase Dose Response Hit/Probe Assessment Assay
IC50
>50000±n/a nM
Citation
 PubChem, PC In vitro MKP-3 Phosphatase Dose Response Hit/Probe Assessment Assay PubChem Bioassay (2007)[AID] 
Target
Name:
Dual specificity protein phosphatase 6
Synonyms:
DUS6_RAT MAP kinase phosphatase 3 Mitogen-activated protein kinase phosphatase 3 | Mkp3
Type:
Enzyme
Mol. Mass.:
42303.19
Organism:
Rattus norvegicus
Description:
gi_16758752
Residue:
381
  
Inhibitor
Name:
BDBM35425
Synonyms:
4-[5-(3-carbomethoxy-5-keto-2-methyl-1,4-dihydroindeno[1,2-b]pyridin-4-yl)-2-furyl]benzoic acid 4-[5-(3-methoxycarbonyl-2-methyl-5-oxo-1,4-dihydroindeno[1,2-b]pyridin-4-yl)-2-furanyl]benzoic acid 4-{5-[3-(methoxycarbonyl)-2-methyl-5-oxo-4,5-dihydro-1H-indeno[1,2-b]pyridin-4-yl]-2-furyl}benzoic acid SMR000070743 | cid_2888976
Type:
Small organic molecule
Emp. Form.:
C26H19NO6
Mol. Mass.:
441.4322
SMILES:
COC(=O)C1C(C2=C(N=C1C)c1ccccc1C2=O)c1ccc(o1)-c1ccc(cc1)C(O)=O
: