Target
Dual specificity protein phosphatase 6
Ligand
BDBM35429
Substrate
Meas. Tech.
In vitro MKP-3 Phosphatase Dose Response Hit/Probe Assessment Assay
IC50
>50000±n/a nM
Citation
 PubChem, PC In vitro MKP-3 Phosphatase Dose Response Hit/Probe Assessment Assay PubChem Bioassay (2007)[AID] 
Target
Name:
Dual specificity protein phosphatase 6
Synonyms:
DUS6_RAT MAP kinase phosphatase 3 Mitogen-activated protein kinase phosphatase 3 | Mkp3
Type:
Enzyme
Mol. Mass.:
42303.19
Organism:
Rattus norvegicus
Description:
gi_16758752
Residue:
381
  
Inhibitor
Name:
BDBM35429
Synonyms:
MLS000097401 N-[3-(6-methyl-[1,2,4]triazolo[3,4-a]phthalazin-3-yl)phenyl]-2-furancarboxamide N-[3-(6-methyl[1,2,4]triazolo[3,4-a]phthalazin-3-yl)phenyl]-2-furamide cid_1988918
Type:
Small organic molecule
Emp. Form.:
C21H15N5O2
Mol. Mass.:
369.3761
SMILES:
Cc1nn2c(nnc2c2ccccc12)-c1cccc(NC(=O)c2ccco2)c1
: