Target
Mevalonate kinase
Ligand
BDBM38667
Substrate
Meas. Tech.
Screening for Inhibitors of the Mevalonate Pathway in Streptococcus Pneumoniae - MK Dose Response
IC50
2755.1±n/a nM
Citation
 PubChem, PC Screening for Inhibitors of the Mevalonate Pathway in Streptococcus Pneumoniae - MK Dose Response PubChem Bioassay (2007)[AID] 
Target
Name:
Mevalonate kinase
Synonyms:
Type:
Enzyme Catalytic Domain
Mol. Mass.:
31420.64
Organism:
Streptococcus pneumoniae D39
Description:
A0A0H2ZQX9
Residue:
292
  
Inhibitor
Name:
BDBM38667
Synonyms:
(2R)-2-(1-ketoisoindolin-2-yl)-2-phenyl-acetic acid (2R)-2-(3-oxo-1H-isoindol-2-yl)-2-phenylacetic acid LON-WEI-4d77710c-19 SMR000097535 | cid_5308032
Type:
Small organic molecule
Emp. Form.:
C16H13NO3
Mol. Mass.:
267.2793
SMILES:
OC(=O)[C@H](N1Cc2ccccc2C1=O)c1ccccc1
: