Target
Dual specificity protein phosphatase 1
Ligand
BDBM32061
Substrate
Meas. Tech.
In vitro MKP-1 Phosphatase Dose Response Active/Probe Assessment Assay - Effects of DTT
IC50
>50000±n/a nM
Citation
 PubChem, PC In vitro MKP-1 Phosphatase Dose Response Active/Probe Assessment Assay - Effects of DTT PubChem Bioassay (2006)[AID] 
Target
Name:
Dual specificity protein phosphatase 1
Synonyms:
CL100 DUSP1 MAP kinase phosphatase 1 MKP1 Protein-tyrosine phosphatase CL100 | VH1
Type:
Protein phosphatase
Mol. Mass.:
39301.48
Organism:
Homo sapiens (Human)
Description:
gi_4758204
Residue:
367
  
Inhibitor
Name:
BDBM32061
Synonyms:
1,8-bis(azanyl)-3,6-dipyrrolidin-1-yl-2,7-naphthyridine-4-carbonitrile 1,8-diamino-3,6-dipyrrolidin-1-yl-2,7-naphthyridine-4-carbonitrile MLS000054131 cid_2997948
Type:
Small organic molecule
Emp. Form.:
C17H21N7
Mol. Mass.:
323.3955
SMILES:
Nc1nc(cc2c(C#N)c(nc(N)c12)N1CCCC1)N1CCCC1
: