Target
Dual specificity protein phosphatase 1
Ligand
BDBM35383
Substrate
Meas. Tech.
In vitro MKP-1 Phosphatase Dose Response Active/Probe Assessment Assay - Effects of Catalase
IC50
26093±n/a nM
Citation
 PubChem, PC In vitro MKP-1 Phosphatase Dose Response Active/Probe Assessment Assay - Effects of Catalase PubChem Bioassay (2006)[AID] 
Target
Name:
Dual specificity protein phosphatase 1
Synonyms:
CL100 DUSP1 MAP kinase phosphatase 1 MKP1 Protein-tyrosine phosphatase CL100 | VH1
Type:
Protein phosphatase
Mol. Mass.:
39301.48
Organism:
Homo sapiens (Human)
Description:
gi_4758204
Residue:
367
  
Inhibitor
Name:
BDBM35383
Synonyms:
MLS000091355 N-(4-methyl-5-oxo-2-[1]benzopyrano[4,3-b]pyridinyl)-4-(1-pyrrolidinylsulfonyl)benzamide N-(4-methyl-5-oxochromeno[4,3-b]pyridin-2-yl)-4-pyrrolidin-1-ylsulfonylbenzamide SMR000025916 | cid_3236129
Type:
Small organic molecule
Emp. Form.:
C24H21N3O5S
Mol. Mass.:
463.506
SMILES:
Cc1cc(NC(=O)c2ccc(cc2)S(=O)(=O)N2CCCC2)nc2c3ccccc3oc(=O)c12
: