Target
Dual specificity protein phosphatase 1
Ligand
BDBM35364
Substrate
Meas. Tech.
In vitro MKP-1 Phosphatase Dose Response Active/Probe Assessment Assay - Reproducibility testing
IC50
21632±n/a nM
Citation
 PubChem, PC In vitro MKP-1 Phosphatase Dose Response Active/Probe Assessment Assay - Reproducibility testing PubChem Bioassay (2006)[AID] 
Target
Name:
Dual specificity protein phosphatase 1
Synonyms:
CL100 DUSP1 MAP kinase phosphatase 1 MKP1 Protein-tyrosine phosphatase CL100 | VH1
Type:
Protein phosphatase
Mol. Mass.:
39301.48
Organism:
Homo sapiens (Human)
Description:
gi_4758204
Residue:
367
  
Inhibitor
Name:
BDBM35364
Synonyms:
MLS000079944 cid_659878
Type:
Small organic molecule
Emp. Form.:
C26H21N5O3
Mol. Mass.:
451.4766
SMILES:
COc1ccc(Cn2c(C)nc3n(Cc4ccco4)c4nc5ccccc5nc4c3c2=O)cc1
: