Target
Dual specificity protein phosphatase 6
Ligand
BDBM34592
Substrate
Meas. Tech.
In vitro MKP-3 Phosphatase Dose Response Active/Probe Assessment Assay - Effects of Catalase
IC50
>50000±n/a nM
Citation
 PubChem, PC In vitro MKP-3 Phosphatase Dose Response Active/Probe Assessment Assay - Effects of Catalase PubChem Bioassay (2006)[AID] 
Target
Name:
Dual specificity protein phosphatase 6
Synonyms:
DUS6_RAT MAP kinase phosphatase 3 Mitogen-activated protein kinase phosphatase 3 | Mkp3
Type:
Enzyme
Mol. Mass.:
42303.19
Organism:
Rattus norvegicus
Description:
gi_16758752
Residue:
381
  
Inhibitor
Name:
BDBM34592
Synonyms:
5,6-bis(azanyl)-3-tert-butyl-8-[2-(hydroxymethyl)piperidin-1-yl]-2-oxidanylidene-1H-pyrrolo[2,3-c][2,7]naphthyridine-9-carbonitrile 5,6-diamino-3-tert-butyl-8-[2-(hydroxymethyl)-1-piperidinyl]-2-oxo-1H-pyrrolo[2,3-c][2,7]naphthyridine-9-carbonitrile MLS000097492 cid_2998196
Type:
Small organic molecule
Emp. Form.:
C21H27N7O2
Mol. Mass.:
409.4848
SMILES:
CC(C)(C)N1C(=O)Cc2c1nc(N)c1c(N)nc(N3CCCCC3CO)c(C#N)c21
: