Target
Dual specificity protein phosphatase 6
Ligand
BDBM35380
Substrate
Meas. Tech.
In vitro MKP-3 Phosphatase Dose Response Active/Probe Assessment Assay - Reproducibility testing
IC50
>50000±n/a nM
Citation
 PubChem, PC In vitro MKP-3 Phosphatase Dose Response Active/Probe Assessment Assay - Reproducibility testing PubChem Bioassay (2007)[AID] 
Target
Name:
Dual specificity protein phosphatase 6
Synonyms:
DUS6_RAT MAP kinase phosphatase 3 Mitogen-activated protein kinase phosphatase 3 | Mkp3
Type:
Enzyme
Mol. Mass.:
42303.19
Organism:
Rattus norvegicus
Description:
gi_16758752
Residue:
381
  
Inhibitor
Name:
BDBM35380
Synonyms:
MLS000096457 N-phenyl-1-pyridin-4-yl-methanimine oxide SMR000062185 | cid_768563
Type:
Small organic molecule
Emp. Form.:
C12H10N2O
Mol. Mass.:
198.2206
SMILES:
[O-]\[N+](=C/c1ccncc1)c1ccccc1
: