Target
M-phase inducer phosphatase 2
Ligand
BDBM38816
Substrate
Meas. Tech.
Cdc25B Catalytic Domain Protein Tyrosine Phosphatase HTS Dose Response Confirmation Assay
IC50
>50000±n/a nM
Citation
 PubChem, PC Cdc25B Catalytic Domain Protein Tyrosine Phosphatase HTS Dose Response Confirmation Assay PubChem Bioassay (2006)[AID] 
Target
Name:
M-phase inducer phosphatase 2
Synonyms:
CDC25B Dual specificity phosphatase (CDC25B) M-phase inducer phosphatase 2 (CDC25B) | MPIP2_HUMAN
Type:
Protein
Mol. Mass.:
64985.27
Organism:
Homo sapiens (Human)
Description:
Residue:
580
  
Inhibitor
Name:
BDBM38816
Synonyms:
MLS000094481 SMR000030042 | cid_3236713
Type:
Small organic molecule
Emp. Form.:
C17H20N4O2
Mol. Mass.:
312.3663
SMILES:
CCN(CC)C(=O)c1cc2c(nc3c(C)cccn3c2=O)n1C
: