Target
M-phase inducer phosphatase 2
Ligand
BDBM38839
Substrate
Meas. Tech.
Cdc25B Catalytic Domain Protein Tyrosine Phosphatase HTS Dose Response Confirmation Assay
IC50
>50000±n/a nM
Citation
 PubChem, PC Cdc25B Catalytic Domain Protein Tyrosine Phosphatase HTS Dose Response Confirmation Assay PubChem Bioassay (2006)[AID] 
Target
Name:
M-phase inducer phosphatase 2
Synonyms:
CDC25B Dual specificity phosphatase (CDC25B) M-phase inducer phosphatase 2 (CDC25B) | MPIP2_HUMAN
Type:
Protein
Mol. Mass.:
64985.27
Organism:
Homo sapiens (Human)
Description:
Residue:
580
  
Inhibitor
Name:
BDBM38839
Synonyms:
1-[2-[2-keto-3-(4-methylbenzyl)imidazolidin-1-yl]acetyl]isonipecotamide 1-[2-[3-[(4-methylphenyl)methyl]-2-oxo-1-imidazolidinyl]-1-oxoethyl]-4-piperidinecarboxamide MLS000120190 cid_5307433
Type:
Small organic molecule
Emp. Form.:
C19H26N4O3
Mol. Mass.:
358.4347
SMILES:
Cc1ccc(CN2CCN(CC(=O)N3CCC(CC3)C(N)=O)C2=O)cc1
: