Target
M-phase inducer phosphatase 2
Ligand
BDBM38842
Substrate
Meas. Tech.
Cdc25B Catalytic Domain Protein Tyrosine Phosphatase HTS Dose Response Confirmation Assay
IC50
>50000±n/a nM
Citation
 PubChem, PC Cdc25B Catalytic Domain Protein Tyrosine Phosphatase HTS Dose Response Confirmation Assay PubChem Bioassay (2006)[AID] 
Target
Name:
M-phase inducer phosphatase 2
Synonyms:
CDC25B Dual specificity phosphatase (CDC25B) M-phase inducer phosphatase 2 (CDC25B) | MPIP2_HUMAN
Type:
Protein
Mol. Mass.:
64985.27
Organism:
Homo sapiens (Human)
Description:
Residue:
580
  
Inhibitor
Name:
BDBM38842
Synonyms:
1-phenylethyl(7H-purin-6-yl)amine N-(1-phenylethyl)-7H-purin-6-amine cid_124293
Type:
Small organic molecule
Emp. Form.:
C13H13N5
Mol. Mass.:
239.2758
SMILES:
CC(Nc1ncnc2nc[nH]c12)c1ccccc1
: