Target
M-phase inducer phosphatase 2
Ligand
BDBM35437
Substrate
Meas. Tech.
Cdc25B Catalytic Domain Protein Tyrosine Phosphatase HTS Dose Response Confirmation Assay
IC50
>50000±n/a nM
Citation
 PubChem, PC Cdc25B Catalytic Domain Protein Tyrosine Phosphatase HTS Dose Response Confirmation Assay PubChem Bioassay (2006)[AID] 
Target
Name:
M-phase inducer phosphatase 2
Synonyms:
CDC25B Dual specificity phosphatase (CDC25B) M-phase inducer phosphatase 2 (CDC25B) | MPIP2_HUMAN
Type:
Protein
Mol. Mass.:
64985.27
Organism:
Homo sapiens (Human)
Description:
Residue:
580
  
Inhibitor
Name:
BDBM35437
Synonyms:
4-O-[4-(4-methoxy-4-oxobutanoyl)oxyphenyl] 1-O-methyl butanedioate O4-[4-(4-methoxy-4-oxidanylidene-butanoyl)oxyphenyl] O1-methyl butanedioate butanedioic acid O4-[4-(4-methoxy-1,4-dioxobutoxy)phenyl] ester O1-methyl ester succinic acid O4-[4-(4-keto-4-methoxy-butanoyl)oxyphenyl] ester O1-methyl ester
Type:
Small organic molecule
Emp. Form.:
C16H18O8
Mol. Mass.:
338.3093
SMILES:
COC(=O)CCC(=O)Oc1ccc(OC(=O)CCC(=O)OC)cc1
: