Target
Isoform 2 of Nuclear receptor ROR-alpha (Alpha-2)
Ligand
BDBM31054
Substrate
Meas. Tech.
Counterscreen for inhibitors of the nuclear receptor Steroidogenic Factor 1 (SF-1): A cell-based dose-response assay for inhibition of the RAR-related orphan receptor A (RORA)
IC50
11090±n/a nM
Citation
 PubChem, PC Counterscreen for inhibitors of the nuclear receptor Steroidogenic Factor 1 (SF-1): A cell-based dose-response assay for inhibition of the RAR-related orphan receptor A (RORA) PubChem Bioassay (2007)[AID] 
Target
Name:
Isoform 2 of Nuclear receptor ROR-alpha (Alpha-2)
Synonyms:
NR1F1 Nuclear receptor ROR-alpha (Alpha-2) RORA RZRA
Type:
PROTEIN
Mol. Mass.:
63033.59
Organism:
Homo sapiens (Human)
Description:
EBI_101591
Residue:
556
  
Inhibitor
Name:
BDBM31054
Synonyms:
(2E)-3,3,3-trifluoro-2-(4-keto-6-methyl-[1,3]oxathiolo[4,5-c]pyran-2-ylidene)propionic acid methyl ester MLS000078159 cid_660939 methyl (2E)-3,3,3-tris(fluoranyl)-2-(6-methyl-4-oxidanylidene-[1,3]oxathiolo[4,5-c]pyran-2-ylidene)propanoate
Type:
Small organic molecule
Emp. Form.:
C11H7F3O5S
Mol. Mass.:
308.23
SMILES:
COC(=O)C(=C1\Oc2cc(C)oc(=O)c2S1)\C(F)(F)F
: