Target
Steroidogenic factor 1
Ligand
BDBM31058
Substrate
Meas. Tech.
Dose-response cell-based assay for inhibitors of the nuclear receptor Steroidogenic Factor 1 (SF-1)
IC50
>407±n/a nM
Citation
 PubChem, PC Dose-response cell-based assay for inhibitors of the nuclear receptor Steroidogenic Factor 1 (SF-1) PubChem Bioassay (2007)[AID] 
Target
Name:
Steroidogenic factor 1
Synonyms:
AD4BP FTZF1 NR5A1 SF-1 STF-1 Steroid hormone receptor Ad4BP
Type:
Nuclear Hormone Receptor
Mol. Mass.:
51643.43
Organism:
Homo sapiens (Human)
Description:
Residue:
461
  
Inhibitor
Name:
BDBM31058
Synonyms:
3-(2-methoxyphenyl)-6-p-phenetyl-7H-[1,2,4]triazolo[3,4-b][1,3,4]thiadiazine MLS000081448 cid_663143
Type:
Small organic molecule
Emp. Form.:
C19H18N4O2S
Mol. Mass.:
366.437
SMILES:
CCOc1ccc(cc1)C1=Nn2c(SC1)nnc2-c1ccccc1OC
: