Target
Steroidogenic factor 1
Ligand
BDBM38956
Substrate
Meas. Tech.
Dose-response cell-based assay for inhibitors of the nuclear receptor Steroidogenic Factor 1 (SF-1)
IC50
189±n/a nM
Citation
 PubChem, PC Dose-response cell-based assay for inhibitors of the nuclear receptor Steroidogenic Factor 1 (SF-1) PubChem Bioassay (2007)[AID] 
Target
Name:
Steroidogenic factor 1
Synonyms:
AD4BP FTZF1 NR5A1 SF-1 STF-1 Steroid hormone receptor Ad4BP
Type:
Nuclear Hormone Receptor
Mol. Mass.:
51643.43
Organism:
Homo sapiens (Human)
Description:
Residue:
461
  
Inhibitor
Name:
BDBM38956
Synonyms:
2-({[2-(4-ethoxyphenyl)-5-methyl-1,3-oxazol-4-yl]methyl}thio)-N-(2-furylmethyl)acetamide 2-[[2-(4-ethoxyphenyl)-5-methyl-1,3-oxazol-4-yl]methylsulfanyl]-N-(furan-2-ylmethyl)ethanamide MLS000046849 SMR000032860 | cid_3237327
Type:
Small organic molecule
Emp. Form.:
C20H22N2O4S
Mol. Mass.:
386.465
SMILES:
CCOc1ccc(cc1)-c1nc(CSCC(=O)NCc2ccco2)c(C)o1
: