Target
Steroidogenic factor 1
Ligand
BDBM39028
Substrate
Meas. Tech.
Dose-response cell-based assay for inhibitors of the nuclear receptor Steroidogenic Factor 1 (SF-1)
IC50
690±n/a nM
Citation
 PubChem, PC Dose-response cell-based assay for inhibitors of the nuclear receptor Steroidogenic Factor 1 (SF-1) PubChem Bioassay (2007)[AID] 
Target
Name:
Steroidogenic factor 1
Synonyms:
AD4BP FTZF1 NR5A1 SF-1 STF-1 Steroid hormone receptor Ad4BP
Type:
Nuclear Hormone Receptor
Mol. Mass.:
51643.43
Organism:
Homo sapiens (Human)
Description:
Residue:
461
  
Inhibitor
Name:
BDBM39028
Synonyms:
3-[(2-chloranylphenoxy)methyl]benzoic acid MLS000063414 cid_584778
Type:
Small organic molecule
Emp. Form.:
C14H11ClO3
Mol. Mass.:
262.688
SMILES:
OC(=O)c1cccc(COc2ccccc2Cl)c1
: