Target
Tyrosine-protein phosphatase non-receptor type 22
Ligand
BDBM31756
Substrate
Meas. Tech.
HTS for LYP Inhibitors-an Autoimmunity Target - Primary screen
IC50
940±n/a nM
Citation
 PubChem, PC HTS for LYP Inhibitors-an Autoimmunity Target - Primary screen PubChem Bioassay (2007)[AID] 
Target
Name:
Tyrosine-protein phosphatase non-receptor type 22
Synonyms:
3.1.3.48 LyP Lymphoid phosphatase (Lyp) PEST-domain phosphatase PTPN22 Tyrosine-protein phosphatase non-receptor type 22 (LYP) | tyrosine-protein phosphatase non-receptor type 22 isoform 1
Type:
Mol. Mass.:
91712.31
Organism:
Homo sapiens (Human)
Description:
Q9Y2R2
Residue:
807
  
Inhibitor
Name:
BDBM31756
Synonyms:
6,7-dimethyl-3a,4,5,9b-tetrahydro-3H-cyclopenta[c]quinoline-4-carboxylic acid cid_646406
Type:
Small organic molecule
Emp. Form.:
C15H17NO2
Mol. Mass.:
243.301
SMILES:
Cc1ccc2C3C=CCC3C(Nc2c1C)C(O)=O
: