Target
Isoform 2 of Nuclear receptor ROR-alpha (Alpha-2)
Ligand
BDBM31058
Substrate
Meas. Tech.
Dose-response cell-based assay for inhibitors of the Retinoic Acid Receptor-related orphan receptor A (RORA)
IC50
1063±n/a nM
Citation
 PubChem, PC Dose-response cell-based assay for inhibitors of the Retinoic Acid Receptor-related orphan receptor A (RORA) PubChem Bioassay (2007)[AID] 
Target
Name:
Isoform 2 of Nuclear receptor ROR-alpha (Alpha-2)
Synonyms:
NR1F1 Nuclear receptor ROR-alpha (Alpha-2) RORA RZRA
Type:
PROTEIN
Mol. Mass.:
63033.59
Organism:
Homo sapiens (Human)
Description:
EBI_101591
Residue:
556
  
Inhibitor
Name:
BDBM31058
Synonyms:
3-(2-methoxyphenyl)-6-p-phenetyl-7H-[1,2,4]triazolo[3,4-b][1,3,4]thiadiazine MLS000081448 cid_663143
Type:
Small organic molecule
Emp. Form.:
C19H18N4O2S
Mol. Mass.:
366.437
SMILES:
CCOc1ccc(cc1)C1=Nn2c(SC1)nnc2-c1ccccc1OC
: