Target
Isoform 2 of Nuclear receptor ROR-alpha (Alpha-2)
Ligand
BDBM38981
Substrate
Meas. Tech.
Dose-response cell-based assay for inhibitors of the Retinoic Acid Receptor-related orphan receptor A (RORA)
IC50
1416±n/a nM
Citation
 PubChem, PC Dose-response cell-based assay for inhibitors of the Retinoic Acid Receptor-related orphan receptor A (RORA) PubChem Bioassay (2007)[AID] 
Target
Name:
Isoform 2 of Nuclear receptor ROR-alpha (Alpha-2)
Synonyms:
NR1F1 Nuclear receptor ROR-alpha (Alpha-2) RORA RZRA
Type:
PROTEIN
Mol. Mass.:
63033.59
Organism:
Homo sapiens (Human)
Description:
EBI_101591
Residue:
556
  
Inhibitor
Name:
BDBM38981
Synonyms:
4-[5-(4-ethoxyphenyl)-1,2-oxazol-3-yl]-N-(3-methoxypropyl)butanamide 4-[5-(4-ethoxyphenyl)isoxazol-3-yl]-N-(3-methoxypropyl)butanamide N-(3-methoxypropyl)-4-(5-p-phenetylisoxazol-3-yl)butyramide cid_3242918
Type:
Small organic molecule
Emp. Form.:
C19H26N2O4
Mol. Mass.:
346.4207
SMILES:
CCOc1ccc(cc1)-c1cc(CCCC(=O)NCCCOC)no1
: