Target
Bcl-2-related protein A1
Ligand
BDBM31067
Substrate
Meas. Tech.
TR-FRET secondary assay for HTS discovery of chemical inhibitors of anti-apoptotic protein Bfl-1
IC50
4510±680 nM
Citation
 PubChem, PC TR-FRET secondary assay for HTS discovery of chemical inhibitors of anti-apoptotic protein Bfl-1 PubChem Bioassay (2008)[AID] 
Target
Name:
Bcl-2-related protein A1
Synonyms:
A1 B-cell leukemia/lymphoma 2 related protein A1a Bcl2a1 Bfl-1 Hemopoietic-specific early response protein | Protein BFL-1
Type:
Apoptosis regulator protein
Mol. Mass.:
19909.74
Organism:
Mus musculus (Mouse)
Description:
gi_11024684
Residue:
172
  
Inhibitor
Name:
BDBM31067
Synonyms:
4-(3,4-dimethoxyphenyl)-2-(methylsulfonyl)-6-(trifluoromethyl)pyrimidine 4-(3,4-dimethoxyphenyl)-2-methylsulfonyl-6-(trifluoromethyl)pyrimidine SMR000022592 | cid_3244140
Type:
Small organic molecule
Emp. Form.:
C14H13F3N2O4S
Mol. Mass.:
362.324
SMILES:
COc1ccc(cc1OC)-c1cc(nc(n1)S(C)(=O)=O)C(F)(F)F
: