Target
Bcl-2-related protein A1
Ligand
BDBM39145
Substrate
Meas. Tech.
TR-FRET secondary assay for HTS discovery of chemical inhibitors of anti-apoptotic protein Bfl-1
IC50
19100±5110 nM
Citation
 PubChem, PC TR-FRET secondary assay for HTS discovery of chemical inhibitors of anti-apoptotic protein Bfl-1 PubChem Bioassay (2008)[AID] 
Target
Name:
Bcl-2-related protein A1
Synonyms:
A1 B-cell leukemia/lymphoma 2 related protein A1a Bcl2a1 Bfl-1 Hemopoietic-specific early response protein | Protein BFL-1
Type:
Apoptosis regulator protein
Mol. Mass.:
19909.74
Organism:
Mus musculus (Mouse)
Description:
gi_11024684
Residue:
172
  
Inhibitor
Name:
BDBM39145
Synonyms:
3-chloranyl-1-(3,4-dichlorophenyl)-4-[4-(4-fluorophenyl)piperazin-1-yl]pyrrole-2,5-dione 3-chloro-1-(3,4-dichlorophenyl)-4-[4-(4-fluorophenyl)piperazin-1-yl]pyrrole-2,5-dione MLS-0090855.0001 | cid_16654651
Type:
Small organic molecule
Emp. Form.:
C20H15Cl3FN3O2
Mol. Mass.:
454.709
SMILES:
Fc1ccc(cc1)N1CCN(CC1)C1=C(Cl)C(=O)N(C1=O)c1ccc(Cl)c(Cl)c1
: