Target
Bcl-2-related protein A1
Ligand
BDBM39151
Substrate
Meas. Tech.
TR-FRET secondary assay for HTS discovery of chemical inhibitors of anti-apoptotic protein Bfl-1
IC50
2140±160 nM
Citation
 PubChem, PC TR-FRET secondary assay for HTS discovery of chemical inhibitors of anti-apoptotic protein Bfl-1 PubChem Bioassay (2008)[AID] 
Target
Name:
Bcl-2-related protein A1
Synonyms:
A1 B-cell leukemia/lymphoma 2 related protein A1a Bcl2a1 Bfl-1 Hemopoietic-specific early response protein | Protein BFL-1
Type:
Apoptosis regulator protein
Mol. Mass.:
19909.74
Organism:
Mus musculus (Mouse)
Description:
gi_11024684
Residue:
172
  
Inhibitor
Name:
BDBM39151
Synonyms:
3-[4-(1,3-benzodioxol-5-ylmethyl)-1-piperazinyl]-4-chloro-1-(3,4-dichlorophenyl)pyrrole-2,5-dione 3-[4-(1,3-benzodioxol-5-ylmethyl)piperazin-1-yl]-4-chloro-1-(3,4-dichlorophenyl)pyrrole-2,5-dione MLS-0090865.0001 | cid_16654661
Type:
Small organic molecule
Emp. Form.:
C22H18Cl3N3O4
Mol. Mass.:
494.755
SMILES:
ClC1=C(N2CCN(Cc3ccc4OCOc4c3)CC2)C(=O)N(C1=O)c1ccc(Cl)c(Cl)c1
: