Target
Bcl-2-related protein A1
Ligand
BDBM39154
Substrate
Meas. Tech.
TR-FRET secondary assay for HTS discovery of chemical inhibitors of anti-apoptotic protein Bfl-1
IC50
4130±550 nM
Citation
 PubChem, PC TR-FRET secondary assay for HTS discovery of chemical inhibitors of anti-apoptotic protein Bfl-1 PubChem Bioassay (2008)[AID] 
Target
Name:
Bcl-2-related protein A1
Synonyms:
A1 B-cell leukemia/lymphoma 2 related protein A1a Bcl2a1 Bfl-1 Hemopoietic-specific early response protein | Protein BFL-1
Type:
Apoptosis regulator protein
Mol. Mass.:
19909.74
Organism:
Mus musculus (Mouse)
Description:
gi_11024684
Residue:
172
  
Inhibitor
Name:
BDBM39154
Synonyms:
3-chloranyl-1-(3,4-dichlorophenyl)-4-(4-phenylpiperazin-1-yl)pyrrole-2,5-dione 3-chloro-1-(3,4-dichlorophenyl)-4-(4-phenylpiperazin-1-yl)-1H-pyrrole-2,5-dione 3-chloro-1-(3,4-dichlorophenyl)-4-(4-phenylpiperazino)-3-pyrroline-2,5-quinone MLS-0090869.0001 | cid_1654287
Type:
Small organic molecule
Emp. Form.:
C20H16Cl3N3O2
Mol. Mass.:
436.719
SMILES:
ClC1=C(N2CCN(CC2)c2ccccc2)C(=O)N(C1=O)c1ccc(Cl)c(Cl)c1
: