Target
Rho-associated protein kinase 2
Ligand
BDBM39299
Substrate
Meas. Tech.
Dose-response biochemical assay of inhibitors of Rho kinase 2 (Rock2)
IC50
6182±n/a nM
Citation
 PubChem, PC Dose-response biochemical assay of inhibitors of Rho kinase 2 (Rock2)  PubChem Bioassay (2007)[AID] 
Target
Name:
Rho-associated protein kinase 2
Synonyms:
KIAA0619 ROCK2 Rho kinase 2 (ROCKII) Rho-associated protein kinase 2 (ROCK2) Rho-associated protein kinase 2/Transforming protein RhoA Rho-associated, coiled-coil-containing protein kinase II p164 ROCK-2
Type:
Protein
Mol. Mass.:
160885.43
Organism:
Homo sapiens (Human)
Description:
O75116
Residue:
1388
  
Inhibitor
Name:
BDBM39299
Synonyms:
3-imidazol-1-ylpropyl(7H-purin-6-yl)amine MLS000101210 N-[3-(1-imidazolyl)propyl]-7H-purin-6-amine cid_4639586
Type:
Small organic molecule
Emp. Form.:
C11H13N7
Mol. Mass.:
243.2678
SMILES:
C(CNc1ncnc2nc[nH]c12)Cn1ccnc1
: