Target
Genome polyprotein
Ligand
BDBM39329
Substrate
Meas. Tech.
West Nile Virus NS2bNS3 Proteinase Inhibitor Dose Response Confirmation.
IC50
>50000±n/a nM
Citation
 PubChem, PC West Nile Virus NS2bNS3 Proteinase Inhibitor Dose Response Confirmation. PubChem Bioassay (2007)[AID] 
Target
Name:
Genome polyprotein
Synonyms:
POLG_WNV | polyprotein precursor
Type:
PROTEIN
Mol. Mass.:
380170.63
Organism:
West Nile virus
Description:
ChEMBL_1438217
Residue:
3430
  
Inhibitor
Name:
BDBM39329
Synonyms:
1-(6-Methyl-2-phenyl-pyrimidin-4-yl)-piperidine-4-carboxylic acid cyclohexylamide N-cyclohexyl-1-(6-methyl-2-phenyl-4-pyrimidinyl)-4-piperidinecarboxamide N-cyclohexyl-1-(6-methyl-2-phenyl-pyrimidin-4-yl)piperidine-4-carboxamide SMR000000727 | cid_650312
Type:
Small organic molecule
Emp. Form.:
C23H30N4O
Mol. Mass.:
378.5105
SMILES:
Cc1cc(nc(n1)-c1ccccc1)N1CCC(CC1)C(=O)NC1CCCCC1
: